Home > Error Code > Gle Error Code 1311

Gle Error Code 1311

Contents

ERROR_LOGIN_WKSTA_RESTRICTION 1241 0x000004D9 The network address could not be used for the operation requested. RPC_S_NO_CALL_ACTIVE 1726 0x000006BE The remote procedure call failed. XenForo style by Pixel Exit ▲ ▼ EntfernenWir verwenden Cookies, um Inhalte zu personalisieren, Werbeanzeigen maßzuschneidern und zu messen sowie die Sicherheit unserer Nutzer zu erhöhen. ERROR_NO_IMPERSONATION_TOKEN 1310 0x0000051E The group may not be disabled. have a peek at these guys

ERROR_INSTALL_PACKAGE_OPEN_FAILED 1620 0x00000654 This installation package could not be opened. ERROR_JOURNAL_ENTRY_DELETED 1200 0x000004B0 The specified device name is invalid. ERROR_BAD_DRIVER_LEVEL 120 0x00000078 This function is not supported on this system. Weitere Informationen zu unseren Cookies und dazu, wie du die Kontrolle darüber behältst, findest du hier: Cookie-Richtlinie.FacebookE-Mail-Adresse oder HandynummerPasswortKonto vergessen?RegistrierenSome common error encountered during remote install of ESET Business Edition aka http://support.eset.com/kb166/?locale=en_US

Sc Error Code 11 Gle Error Code 1460

RPC_S_CANNOT_SUPPORT 1765 0x000006E5 No security context is available to allow impersonation. ERROR_TOO_MANY_SEMAPHORES 101 0x00000065 The exclusive semaphore is owned by another process. ERROR_CANT_ACCESS_DOMAIN_INFO 1352 0x00000548 The security account manager (SAM) or local security authority (LSA) server was in the wrong state to perform the security operation.

ERROR_DLL_INIT_FAILED 1115 0x0000045B A system shutdown is in progress. ERROR_REG_NAT_CONSUMPTION 1262 0x000004EE The share is currently offline or does not exist. ERROR_INVALID_MENU_HANDLE 1402 0x0000057A Invalid cursor handle. Could Not Install Eset Installer On Target Computer (sc Error Code 11, Gle Error Code 5) ERROR_INVALID_EXE_SIGNATURE 192 0x000000C0 The operating system cannot run %1.

ERROR_DISCARDED 158 0x0000009E The segment is already unlocked. Sc Error Code 11 Gle Error Code 5 Please contact your system administrator. ERROR_BUFFER_OVERFLOW 112 0x00000070 There is not enough space on the disk. http://support.eset.com/kb294/?locale=en_US ERROR_INVALID_GROUP_ATTRIBUTES 1346 0x00000542 Either a required impersonation level was not provided, or the provided impersonation level is invalid.

RPC_S_ADDRESS_ERROR 1769 0x000006E9 A floating-point operation at the RPC server caused a division by zero. Sc Error Code 15 Gle Error Code 1073 Disconnect all previous connections to the server or shared resource and try again. 1220 An attempt was made to establish a session to a network server, but there are already too ERROR_UNKNOWN_REVISION 1306 0x0000051A Indicates two revision levels are incompatible. ERROR_RING2SEG_MUST_BE_MOVABLE 201 0x000000C9 The operating system cannot run %1.

Sc Error Code 11 Gle Error Code 5

The owner node cannot run this resource. 5072 The cluster node is not ready to perform the requested operation. 5073 The cluster node is shutting down. 5074 The cluster join operation Wird geladen... Sc Error Code 11 Gle Error Code 1460 ERROR_IS_SUBST_TARGET 150 0x00000096 System trace information was not specified in your CONFIG.SYS file, or tracing is disallowed. Sc Error Code 6, Gle Error Code 53 Wenn du bei YouTube angemeldet bist, kannst du dieses Video zu einer Playlist hinzufügen.

ERROR_DLL_NOT_FOUND 1158 0x00000486 The current process has used all of its system allowance of handles for Window Manager objects. More about the author ERROR_INVALID_ORDINAL 183 0x000000B7 Cannot create a file when that file already exists. ERROR_ITERATED_DATA_EXCEEDS_64k 195 0x000000C3 The operating system cannot run %1. ERROR_INVALID_FLAG_NUMBER 187 0x000000BB The specified system semaphore name was not found. Eset Exit Code 1603 Fatal Error During Installation

ERROR_END_OF_MEDIA 1101 0x0000044D A tape access reached a filemark. ERROR_FLOPPY_WRONG_CYLINDER 1124 0x00000464 The floppy disk controller reported an error that is not recognized by the floppy disk driver. ERROR_CLASS_DOES_NOT_EXIST 1412 0x00000584 Class still has open windows. http://imagextension.com/error-code/ftp-return-code-10000-error-code-00009.php ERROR_CANNOT_MAKE 83 0x00000053 Fail on INT 24.

RPC_S_INVALID_AUTH_IDENTITY 1750 0x000006D6 The authorization service is unknown. Could Not Install Eset Installer On Target Computer Sc Error Code 15 ERROR_DUPLICATE_SERVICE_NAME 1079 0x00000437 The account specified for this service is different from the account specified for other services running in the same process. ERROR_BROKEN_PIPE 110 0x0000006E The system cannot open the device or file specified.

ERROR_BAD_INHERITANCE_ACL 1341 0x0000053D The server is currently disabled.

Use the automatic error 1311 fix tool to get rid of this lethal error code in no time. ERROR_INVALID_HANDLE_STATE 1610 0x0000064A The configuration data for this product is corrupt. RPC_S_CALL_FAILED 1727 0x000006BF The remote procedure call failed and did not execute. Eset Install Error 1603 Windows 10 ERROR_UNRECOGNIZED_VOLUME 1006 0x000003EE The volume for a file has been externally altered so that the opened file is no longer valid.

The registry could not read in, or write out, or flush, one of the files that contain the system's image of the registry. 1017 The system has attempted to load or ERROR_NO_WILDCARD_CHARACTERS 1418 0x0000058A Thread does not have a clipboard open. ERROR_WAIT_NO_CHILDREN 129 0x00000081 The %1 application cannot be run in Win32 mode. news ERROR_SET_POWER_STATE_VETOED 1141 0x00000475 The system BIOS failed an attempt to change the system power state.

http://kb.eset.com/esetkb/index?page=content&id=SOLN271 SamSa, Jun 2, 2009 #2 SamSa Eset Staff Account Joined: May 14, 2009 Posts: 47 Oh another helpful KB article is the "Push Installation Requirements and checklist". ERROR_NOT_LOGGED_ON 1246 0x000004DE Continue with work in progress. Anmelden Statistik 13.221 Aufrufe 3 Dieses Video gefällt dir? ERROR_BAD_NET_RESP 59 0x0000003B An unexpected network error occurred.

ERROR_INVALID_WINDOW_HANDLE 1401 0x00000579 Invalid menu handle. The server's password is out of date at the domain controller. ERROR_NO_UNICODE_TRANSLATION 1114 0x0000045A A dynamic link library (DLL) initialization routine failed. To configure or remove the existing version of this product, use Add/Remove Programs on the Control Panel.

ERROR_DIR_NOT_ROOT 145 0x00000091 The directory is not empty. Windows Based Enterprise Management (WBEM) error codes -2147749889, 0x80041001, The call failed. -2147749890, 0x80041002, The object could not be found. -2147749891, 0x80041003, The current user does not have permission to perform The recovery was successful. 1015 The registry is corrupted.

© 2017 imagextension.com