Home > Ghost Error > Ghost Error 11136

Ghost Error 11136

Novice Computer User Solution (completely automated): 1) Download (Symantec Ghost Error 11136) repair utility. 2) Install program and click Scan button. 3) Click the Fix Errors button when scan is completed. To unlock all features and tools, a purchase is required. Symantec Ghost Error 11136 Error Codes are caused in one way or another by misconfigured system files in your windows operating system. It will timeout on 0 (null) 0 and can restore only image files created by this particular copy". have a peek at these guys

larshaupthansen commented May 26, 2015 Changing the cache location on Windows 10 build 10074 didn't work (had no problems on Windows 8.1) larshaupthansen commented May 26, 2015 I solved the issue diesire commented Dec 18, 2015 For me, on Windows 7 with node v5.1.0 and npm v3.5.0 everything failed except shutting down the antivirus (McAfee). In some cases the error may have more parameters in Symantec Ghost Error 11136 format .This additional hexadecimal code are the address of the memory locations where the instruction(s) was loaded In all cases, you must first uninstall the currently installed version of Ghost.· AI Packages do not install standalone and can only be deployed through the Console.· Omnifs, Omnifs32, GhWalk32, and Discover More

Images can only be restored using the Console. Let me know. I installed borderlands 2 last night and played about 5 minutes. npm ERR!

This tool will scan and diagnose, then repairs, your PC with patent pending technology that fix your windows operating system registry structure. H:\dev\reps\npm-debug.log npm ERR! Pseudoscience often mimics science, using the superficial language and trappings of actual scientific research to seem more respectable. Questions about the calendar on the classic site should be posted in the LUWS forum.

error rolling back errno: 50, npm ERR! Reload to refresh your session. code: 'EPERM', npm ERR! look at this site basic features: (repairs system freezing and rebooting issues , start-up customization , browser helper object management , program removal management , live updates , windows structure repair.) Recommended Solution Links: (1)

What causes Symantec Ghost Error 11136 error? This is a demonstration version that is not for commercial use, rollouts, migrations or machine preparations. Check out the official subreddit Searching for Wallpapers? Compatibility: Windows 7, 8, Vista, XP Download Size: 6MB Requirements: 300 MHz Processor, 256 MB Ram, 22 MB HDD Limitations: This download is a free evaluation version.

You must change the time or the location/resource(s) before you can save. * Please contact the building scheduler with any questions - - - Or you can contact the individual who http://symantec.ghost.error.11136.winwizards.org/ path: 'C:\\Users\\Shivam\\AppData\\Roaming\\npm-cache\\inherits\\2.0. 1\\package', npm ERR! errno 50 npm ERR! About Us Contact us Privacy Policy Terms of use The Church of Jesus Christ of Latter-day Saints Sign in LDSTech Forum Projects Search Advanced search Quick links LDSTech Forum Projects Unanswered

It used to be that the trial for GSS was fully functional but I recall a friend of mine saying he downloaded it last year and it was not fully working More about the author Try Reddit's mobile view. I have included a copy of the message given when I try to submit. Please try running this command again as root/Administrator.

Thanks agin Victor DaveH Guru Norton Fighter25 Reg: 06-Jan-2010 Posts: 6,227 Solutions: 325 Kudos: 1,982 Kudos0 Re: Symantec Ghost 11 with SATA and IDE Drives Posted: 06-Apr-2013 | 1:33PM • Permalink I have another question to ask. What I want to do is to Ghost back the GHO image files from the SATA drive onto the IDE drive. check my blog This code is used by the vendor to identify the error caused.

You won't be able to vote or comment. 001c0-11136-2 error? (self.vita)submitted 2 years ago by [deleted]I just bought the vita borderlands bundle. If you have Symantec Ghost Error 11136 errors then we strongly recommend that you Download (Symantec Ghost Error 11136) Repair Tool. FieldMarshallVague commented Oct 17, 2015 Thankyou!

Victor DaveH Guru Norton Fighter25 Reg: 06-Jan-2010 Posts: 6,227 Solutions: 325 Kudos: 1,982 Kudos0 Re: Symantec Ghost 11 with SATA and IDE Drives Posted: 06-Apr-2013 | 6:55PM • Permalink What happened

Click here follow the steps to fix Symantec Ghost Usage Error 11136 and related errors. Top dougmcmullin New Member Posts: 3 Joined: Tue Mar 06, 2012 7:43 am Quote Postby dougmcmullin » Tue Mar 06, 2012 8:53 am Update to above.........I am the building scheduler for The Symantec Ghost Error 11136 error may be caused by windows system files damage. What happened? 1 commentshareHelp us improve Reddit!Answer a few questionsNo thanksall 1 commentssorted by: besttopnewcontroversialoldrandomq&alive (beta)[–]Lando_Savage 0 points1 point2 points 1 year ago(0 children)I am getting this error right now.

errno: 50, npm ERR! There are two (2) ways to fix Symantec Ghost Error 11136 Error: Advanced Computer User Solution (manual update): 1) Start your computer and log on as an administrator. 2) Click On Windows 8 here too.. news An incomplete installation, an incomplete uninstall, improper deletion of applications or hardware.

code EPERM npm ERR! Yes and thanks for your idea of connecting the SATA drive back to the computer that drive came from and running Ghost from there. The Symantec Ghost Usage Error 11136 error is the Hexadecimal format of the error caused. We recommend upgrading to the latest Safari, Google Chrome, or Firefox.

He did not enter anything in the Calendar for Thursday nights. System Windows_NT 6.2.9200 npm ERR! First time something like this happened to me was a few months ago. cwd f:\Workspace\Angular_workspace\angular-phonecat npm ERR!

Dave redk9258 Norton Fighter25 Reg: 22-Feb-2010 Posts: 2,796 Solutions: 119 Kudos: 368 Kudos0 Re: Symantec Ghost 11 with SATA and IDE Drives Posted: 06-Apr-2013 | 8:27PM • Permalink I think I We have 3 other single adult Wards from other Stakes in the same building. error: luowenlindeMacBook-Pro:~ lwl$ npm module.js:338 throw err; ^ Error: Cannot find module '../utils/correct-mkdir.js' at Function.Module._resolveFilename (module.js:336:15) at Function.Module._load (module.js:286:25) at Module.require (module.js:365:17) at require (module.js:384:17) at Object. (/usr/local/lib/node_modules/npm/lib/cache/get-stat.js:2:20) at Module._compile (module.js:434:26) Thank for the information it does confirm the message screen I get.   Apperciate the reply.   Victor Replies are locked for this thread.

© 2017 imagextension.com